Skip to content

Version 11.9

Version 11.9 #3528

Triggered via pull request February 4, 2025 00:53
Status Success
Total duration 19m 48s
Artifacts

crashlytics.yml

on: pull_request
Matrix: pod-lib-lint
spm-package-resolved
1m 17s
spm-package-resolved
Matrix: crashlytics-cron-only
Matrix: spm
Fit to window
Zoom out
Zoom in

Annotations

20 errors and 9 warnings
spm (macos-15, Xcode_16.1, iOS): Crashlytics/UnitTests/FIRCLSSettingsTests.m#L150
testActivatedSettingsMissingCacheKey, Asynchronous wait failed: Exceeded timeout of 5 seconds, with unfulfilled expectations: "FIRCLSMockFileManager.removeExpectation.reload".
spm (macos-15, Xcode_16.1, iOS): Crashlytics/UnitTests/FIRCLSSettingsTests.m#L137
testCorruptCache, Asynchronous wait failed: Exceeded timeout of 1 seconds, with unfulfilled expectations: "FIRCLSMockFileManager.removeExpectation.cache".
spm (macos-15, Xcode_16.1, iOS): Crashlytics/UnitTests/FIRCLSSettingsTests.m#L150
testCorruptCacheKey, Asynchronous wait failed: Exceeded timeout of 5 seconds, with unfulfilled expectations: "FIRCLSMockFileManager.removeExpectation.reload".
spm (macos-13, Xcode_15.2, iOS): Crashlytics/UnitTests/FIRCLSSettingsTests.m#L150
testActivatedSettingsMissingCacheKey, Asynchronous wait failed: Exceeded timeout of 5 seconds, with unfulfilled expectations: "FIRCLSMockFileManager.removeExpectation.reload".
spm (macos-13, Xcode_15.2, iOS): Crashlytics/UnitTests/FIRCLSSettingsTests.m#L137
testCorruptCache, Asynchronous wait failed: Exceeded timeout of 1 seconds, with unfulfilled expectations: "FIRCLSMockFileManager.removeExpectation.cache".
spm (macos-13, Xcode_15.2, iOS): Crashlytics/UnitTests/FIRCLSSettingsTests.m#L150
testCorruptCacheKey, Asynchronous wait failed: Exceeded timeout of 5 seconds, with unfulfilled expectations: "FIRCLSMockFileManager.removeExpectation.reload".
spm (macos-13, Xcode_15.2, iOS): Crashlytics/UnitTests/FIRCLSSettingsTests.m#L150
testGoogleAppIDChanged, Asynchronous wait failed: Exceeded timeout of 5 seconds, with unfulfilled expectations: "FIRCLSMockFileManager.removeExpectation.reload".
spm (macos-14, Xcode_15.4, iOS): Crashlytics/UnitTests/FIRCLSSettingsTests.m#L150
testActivatedSettingsMissingCacheKey, Asynchronous wait failed: Exceeded timeout of 5 seconds, with unfulfilled expectations: "FIRCLSMockFileManager.removeExpectation.reload".
spm (macos-14, Xcode_15.4, iOS): Crashlytics/UnitTests/FIRCLSSettingsTests.m#L137
testCorruptCache, Asynchronous wait failed: Exceeded timeout of 1 seconds, with unfulfilled expectations: "FIRCLSMockFileManager.removeExpectation.cache".
spm (macos-14, Xcode_15.4, iOS): Crashlytics/UnitTests/FIRCLSSettingsTests.m#L150
testCorruptCacheKey, Asynchronous wait failed: Exceeded timeout of 5 seconds, with unfulfilled expectations: "FIRCLSMockFileManager.removeExpectation.reload".
spm (macos-14, Xcode_15.4, iOS): Crashlytics/UnitTests/FIRCLSSettingsTests.m#L150
testGoogleAppIDChanged, Asynchronous wait failed: Exceeded timeout of 5 seconds, with unfulfilled expectations: "FIRCLSMockFileManager.removeExpectation.reload".
spm (macos-14, Xcode_15.4, iOS): Crashlytics/UnitTests/FIRCLSSettingsTests.m#L137
testCorruptCache, Asynchronous wait failed: Exceeded timeout of 1 seconds, with unfulfilled expectations: "FIRCLSMockFileManager.removeExpectation.cache".
spm (macos-15, Xcode_16.1, macOS): Crashlytics/UnitTests/FIRCLSProcessReportOperationTests.m#L109
testExceptionSymbolication, (([sections count]) equal to (1)) failed: ("0") is not equal to ("1")
spm (macos-15, Xcode_16.1, macOS): Crashlytics/UnitTests/FIRCLSProcessReportOperationTests.m#L110
testExceptionSymbolication, ((sections[0][@"threads"][0][0][@"library"]) equal to (@"libA")) failed: throwing "NSRangeException: *** -[__NSArrayM objectAtIndexedSubscript:]: index 0 beyond bounds for empty array"
spm (macos-15, Xcode_16.1, macOS): Crashlytics/UnitTests/FIRCLSProcessReportOperationTests.m#L111
testExceptionSymbolication, ((sections[0][@"threads"][0][0][@"offset"]) equal to (@(10))) failed: throwing "NSRangeException: *** -[__NSArrayM objectAtIndexedSubscript:]: index 0 beyond bounds for empty array"
spm (macos-15, Xcode_16.1, macOS): Crashlytics/UnitTests/FIRCLSProcessReportOperationTests.m#L112
testExceptionSymbolication, ((sections[0][@"threads"][0][0][@"symbol"]) equal to (@"testSymbolA")) failed: throwing "NSRangeException: *** -[__NSArrayM objectAtIndexedSubscript:]: index 0 beyond bounds for empty array"
spm (macos-15, Xcode_16.1, visionOS): Crashlytics/UnitTests/FIRCLSSettingsTests.m#L150
testActivatedSettingsMissingCacheKey, Asynchronous wait failed: Exceeded timeout of 5 seconds, with unfulfilled expectations: "FIRCLSMockFileManager.removeExpectation.reload".
spm (macos-15, Xcode_16.1, visionOS): Crashlytics/UnitTests/FIRCLSSettingsTests.m#L137
testCorruptCache, Asynchronous wait failed: Exceeded timeout of 1 seconds, with unfulfilled expectations: "FIRCLSMockFileManager.removeExpectation.cache".
spm (macos-15, Xcode_16.1, visionOS): Crashlytics/UnitTests/FIRCLSSettingsTests.m#L150
testCorruptCacheKey, Asynchronous wait failed: Exceeded timeout of 5 seconds, with unfulfilled expectations: "FIRCLSMockFileManager.removeExpectation.reload".
spm (macos-15, Xcode_16.1, visionOS): Crashlytics/UnitTests/FIRCLSSettingsTests.m#L150
testGoogleAppIDChanged, Asynchronous wait failed: Exceeded timeout of 5 seconds, with unfulfilled expectations: "FIRCLSMockFileManager.removeExpectation.reload".
spm-package-resolved
Cache save failed.
catalyst
Attempt 1 failed. Reason: Child_process exited with error code 65
pod-lib-lint (ios, macos-15, Xcode_16.1)
Attempt 1 failed. Reason: Child_process exited with error code 1
spm (macos-14, Xcode_15.4, iOS)
Attempt 1 failed. Reason: Child_process exited with error code 1
spm (macos-15, Xcode_16.1, macOS)
Attempt 1 failed. Reason: Child_process exited with error code 1
spm (macos-15, Xcode_16.1, macOS)
Attempt 2 failed. Reason: Child_process exited with error code 1
spm (macos-15, Xcode_16.1, visionOS)
Attempt 1 failed. Reason: Child_process exited with error code 1
pod-lib-lint (tvos, macos-15, Xcode_16.1)
Attempt 1 failed. Reason: Child_process exited with error code 1
pod-lib-lint (tvos, macos-15, Xcode_16.1)
Attempt 2 failed. Reason: Child_process exited with error code 1