Skip to content

fix: worker instantiation (#31) #7

fix: worker instantiation (#31)

fix: worker instantiation (#31) #7

Triggered via push September 20, 2024 23:10
Status Failure
Total duration 2m 11s
Artifacts

changesets.yml

on: push
Fit to window
Zoom out
Zoom in

Annotations

10 errors and 2 warnings
packages/core-web/src/FedimintWallet.test.ts > Error on open & join if wallet is already open: packages/core-web/src/FedimintWallet.test.ts#L42
AssertionError: expected false to be true // Object.is equality - Expected + Received - true + false ❯ packages/core-web/src/FedimintWallet.test.ts:42:26
packages/core-web/src/FedimintWallet.test.ts > getConfig: packages/core-web/src/FedimintWallet.test.ts#L64
AssertionError: expected false to be true // Object.is equality - Expected + Received - true + false ❯ packages/core-web/src/FedimintWallet.test.ts:64:26
packages/core-web/src/FedimintWallet.test.ts > empty getBalance: packages/core-web/src/FedimintWallet.test.ts#L71
AssertionError: expected false to be true // Object.is equality - Expected + Received - true + false ❯ packages/core-web/src/FedimintWallet.test.ts:71:26
packages/core-web/src/FedimintWallet.test.ts > Error on open & join if wallet is already open: packages/core-web/src/FedimintWallet.test.ts#L42
AssertionError: expected false to be true // Object.is equality - Expected + Received - true + false ❯ packages/core-web/src/FedimintWallet.test.ts:42:26
packages/core-web/src/FedimintWallet.test.ts > getConfig: packages/core-web/src/FedimintWallet.test.ts#L64
AssertionError: expected false to be true // Object.is equality - Expected + Received - true + false ❯ packages/core-web/src/FedimintWallet.test.ts:64:26
packages/core-web/src/FedimintWallet.test.ts > empty getBalance: packages/core-web/src/FedimintWallet.test.ts#L71
AssertionError: expected false to be true // Object.is equality - Expected + Received - true + false ❯ packages/core-web/src/FedimintWallet.test.ts:71:26
packages/core-web/src/FedimintWallet.test.ts > Error on open & join if wallet is already open: packages/core-web/src/FedimintWallet.test.ts#L42
AssertionError: expected false to be true // Object.is equality - Expected + Received - true + false ❯ packages/core-web/src/FedimintWallet.test.ts:42:26
packages/core-web/src/FedimintWallet.test.ts > getConfig: packages/core-web/src/FedimintWallet.test.ts#L64
AssertionError: expected false to be true // Object.is equality - Expected + Received - true + false ❯ packages/core-web/src/FedimintWallet.test.ts:64:26
packages/core-web/src/FedimintWallet.test.ts > empty getBalance: packages/core-web/src/FedimintWallet.test.ts#L71
AssertionError: expected false to be true // Object.is equality - Expected + Received - true + false ❯ packages/core-web/src/FedimintWallet.test.ts:71:26
Verify / Test
Final attempt failed. Child_process exited with error code 1
Verify / Test
Attempt 1 failed. Reason: Child_process exited with error code 1
Verify / Test
Attempt 2 failed. Reason: Child_process exited with error code 1